{"text_format":"1","workbook":"xlsx","n_sheets":8,"sheets":["Summary","Globals","EV of Far Future","GiveDirectly","THL","Cage-Free","AI Safety","AI Targeted Values Spreading"],"not_rendered":{"charts":0,"images":0,"macros":1,"external_links":0,"defined_names":36,"comments":0,"pivot_tables":0},"unopened":[],"bounds":{"document_bytes":16777216,"sheet_cells":100000,"rows_first":2000,"rows_last":500,"rows_between":2000,"halvings":0,"cell_chars":16384,"cell_head_chars":4096},"cells_cut":3,"cells_raw":0,"read":"whole","date_system":"1900"}

{"sheet":"Summary","index":0,"n_rows":25,"n_cols":11,"rows_kept":25,"cut":false,"hidden":false,"merged":[]}
["Total utility",null,null,null,null,null,"Utility from direct effects only"]
[null,"Pareto","Log-normal","Ratio vs. GD",null,null,null,"Mean ","Variance","Pareto","Log-normal"]
["GiveDirectly",{"$f":"GiveDirectly!B30","v":-1021738259900382.6},{"$f":"GiveDirectly!B31","v":{"$error":"#VALUE!"}},{"$f":"C3/$C$3","v":{"$error":"#VALUE!"}},null,null,"GiveDirectly",{"$f":"GiveDirectly!G3","v":1},{"$f":"GiveDirectly!H3","v":4.0000000000000008E-2},{"$f":"GiveDirectly!G4","v":0.85832741114212496},{"$f":"GiveDirectly!G5","v":"disabled"}]
["THL",{"$f":"THL!B34","v":{"$error":"#VALUE!"}},{"$f":"THL!B35","v":{"$error":"#VALUE!"}},{"$f":"C4/C3","v":{"$error":"#VALUE!"}},null,null,"AMF",{"$f":"D17","v":11.224972160321824},{"$f":"E17","v":7.4864535847752101E-2},{"$f":"ParetoPosterior(median,alpha,H4:I4)","v":7.6651731591110082},{"$f":"LognormPosterior(mu_global_poverty,sigma_global_poverty,H4:I4)","v":7.68136697438384}]
["Cage-Free",{"$f":"'Cage-Free'!B23","v":1.7155923138575062E+24},{"$f":"'Cage-Free'!B24","v":122694.70790374537},{"$f":"C5/C3","v":{"$error":"#VALUE!"}},null,null,"THL",{"$f":"THL!I5","v":5429.9171264394072},{"$f":"THL!J5","v":0.49504262895320128},{"$f":"THL!I6","v":396.49368154968971},{"$f":"THL!I7","v":194.83133807235006}]
["AI Safety",{"$f":"'AI Safety'!B11","v":6.3112967095697664E+27},{"$f":"'AI Safety'!B12","v":213917.63204134765},{"$f":"C6/$C$3","v":{"$error":"#VALUE!"}},null,null,"Cage-free Campaigns",{"$f":"'Cage-Free'!I5","v":88741.196746494257},{"$f":"'Cage-Free'!J5","v":0.31528753718843733},{"$f":"'Cage-Free'!I6","v":16679.269175199799},{"$f":"'Cage-Free'!I7","v":2531.88913733256}]
["AI Targeted Values Spreading",{"$f":"'AI Targeted Values Spreading'!B23","v":7.21322996525908E+36},{"$f":"'AI Targeted Values Spreading'!B24","v":25902525.57153099},{"$f":"C7/$C$3","v":{"$error":"#VALUE!"}}]
[]
[]
["All Cause Areas"]
{"$rows_left_out":16}
{"sheet":"Globals","index":1,"n_rows":48,"n_cols":16,"rows_kept":48,"cut":false,"hidden":false,"merged":[]}
["Enable calculations?",null,"Prior (log-normal)",null,null,null,null,null,null,"Prior (Pareto)"]
[0,"0 for false, 1 for true",null,"policy","global poverty","factory farming","far future"]
["For detailed explanations of everything, see http://mdickens.me/2016/05/17/quantifying_far_future_effects/",null,"mu",0.1,0.1,1,10,"mu","center of distribution (median)",null,"median",0.1]
[null,null,"sigma",{"$f":"sigma_global_poverty","v":0.75},0.75,{"$f":"sigma_global_poverty","v":0.75},{"$f":"sigma_global_poverty","v":0.75},"sigma","scale (logarithmic base 10); this corresponds to standard deviation, not variance",null,"alpha",1.5]
[null,null,"log-normal prior is parameterized by Y = mu*10^(sigma*X) for standard normal R.V. X",null,null,null,"TODO: maybe far future sigma should be bigger"]
[]
["Far future outcome probabilities",null,null,"Outcomes in a column are conditional on outcomes to the left, e.g. P(we reduce WAS on balance) = D8*B8. I explain my reasoning here: http://mdickens.me/2016/04/17/preventing_human_extinction,_now_with_numbers!/",null,null,null,null,null,"Color guide",null,"Basic facts"]
["stay on earth",0.2,"we reduce WAS on balance",0.7,"WAS = wild animal suffering",null,null,null,null,"final result",null,"factory farmed animals",20000000000]
["fill universe with biology",0.4,"society doesn't care about animals",0.8,"we have factory farming",0.3,null,null,null,"intermediate result",null,"interest rate",0.05]
[null,null,null,"not mutually exclusive so don't need to sum to 1","we spread WAS",0.4,null,null,null,"utility estimate"]
{"$rows_left_out":39}
{"sheet":"EV of Far Future","index":2,"n_rows":35,"n_cols":15,"rows_kept":35,"cut":false,"hidden":false,"merged":[]}
["Computronium Condition",null,null,null,null,"Biological Condition",null,null,null,null,"Results","TODO: this manually categorizes conditions as positive or negative, that should happen automatically"]
[null,"Mu","Sigma^2 (orders of magnitude)","Notes",null,null,"Mu","Sigma^2 (orders of magnitude)","Notes",null,null,"P-weighted utility estimate (adj. by probability)","Sigma^2",null,"Probability (used in P-weighted utility estimate)"]
["accessible stars",{"$f":"VLOOKUP($A3,Globals!$J$36:$L$40,2,FALSE)","v":3162277660168.3794},{"$f":"VLOOKUP($A3,Globals!$J$36:$L$40,3,FALSE)","v":1.1704562191085683},null,null,"accessible stars",{"$f":"VLOOKUP($F3,Globals!$N$36:$P$42,2,FALSE)","v":1000000000000},{"$f":"VLOOKUP($F3,Globals!$N$36:$P$42,3,FALSE)","v":1.5606082921447579},null,null,"human weighted utility",{"$f":"G10*O3","v":1.2649110640673517E+34},{"$f":"H10","v":2.7310645112533267},"P(humans exist)",{"$f":"p_biological","v":0.4}]
["years of future",{"$f":"VLOOKUP($A4,Globals!$J$36:$L$40,2,FALSE)","v":316227766016.83789},{"$f":"VLOOKUP($A4,Globals!$J$36:$L$40,3,FALSE)","v":0.39015207303618948},null,null,"years of future",{"$f":"VLOOKUP($F4,Globals!$N$36:$P$42,2,FALSE)","v":316227766016.83789},{"$f":"VLOOKUP($F4,Globals!$N$36:$P$42,3,FALSE)","v":0.39015207303618948},null,null,"hedonium weighted utility",{"$f":"B11*O4","v":6.3245553203367595E+46},{"$f":"C11","v":3.5113686573257055},"P(hedonium exists)",{"$f":"p_computronium*p_hedonium","v":2.0000000000000004E-2}]
["usable wattage",{"$f":"VLOOKUP($A5,Globals!$J$36:$L$40,2,FALSE)","v":3.1622776601683796E+22},{"$f":"VLOOKUP($A5,Globals!$J$36:$L$40,3,FALSE)","v":1.9507603651809475},null,null,null,null,null,null,null,"em weighted utility",{"$f":"B16*O5","v":3.7947331922020553E+44},{"$f":"C16","v":3.5113686573257055},"P(ems exist)",{"$f":"p_computronium*p_ems","v":0.12}]
["brains per watt",{"$f":"VLOOKUP($A6,Globals!$J$36:$L$40,2,FALSE)","v":0.1},{"$f":"VLOOKUP($A6,Globals!$J$36:$L$40,3,FALSE)","v":0},null,null,null,null,null,null,null,"pos EV (buckets)",{"$f":"WriteArray(SumLognormDists(L3:M5))","v":{"$cut":{"chars":16952,"head":"0,0,0,0,0,0,0,0,0,0,0,0,0,0,0,0,0,0,0,0,0,0,0,0,0,0,0,0,0,0,0,0,0,0,0,0,0,0,0,0,0,0,0,0,0,0,0,0,0,0,0,0,0,0,0,0,0,0,0,0,0,0,0,0,0,0,0,0,0,0,0,0,0,0,0,0,0,0,0,0,0,0,0,0,0,0,0,0,0,0,0,0,0,0,0,0,0,0,0,0,0,0,0,0,0,0,0,0,0,0,0,0,0,0,0,0,0,0,0,0,0,0,0,0,0,0,0,0,0,0,0,0,0,0,0,0,0,0,0,0,0,0,0,0,0,0,0,0,0,0,0,0,0,0,0,0,0,0,0,0,0,0,0,0,0,0,0,0,0,0,0,0,0,0,0,0,0,0,0,0,0,0,0,0,0,0,0,0,0,0,0,0,0,0,0,0,0,0,0,0,0,0,0,0,0,0,0,0,0,0,0,0,0,0,0,0,0,0,0,0,0,0,0,0,0,0,1.13635098543487E-322,2.86064008942082E-321,7.82352950189614E-320,2.11846949820747E-318,5.68639568578572E-317,1.51301249366545E-315,3.99059549783592E-314,1.0433324472202E-312,2.70394320981619E-311,6.94644010594307E-310,1.76895560463227E-308,4.46541176037963E-307,1.11736756867045E-305,2.77153658531431E-304,6.81451898459864E-303,1.6608861527923E-301,4.01268089437394E-300,9.60991438100703E-299,2.28136397995568E-297,5.36858512152124E-296,1.25232007297173E-294,2.89575029608221E-293,6.63738761782539E-292,1.5080772577042E-290,3.39656847252815E-289,7.58311367516393E-288,1.67820574353692E-286,3.6815721859586E-285,8.00593305265291E-284,1.72576295090038E-282,3.68757547915183E-281,7.81072456039602E-280,1.63995674136441E-278,3.41321907911449E-277,7.04184850557139E-276,1.44012427243931E-274,2.91947043203558E-273,5.86676982584578E-272,1.16865121604437E-270,2.30760631137015E-269,4.5167858295317E-268,8.76371602759129E-267,1.6855364708136E-265,3.21350597675842E-264,6.07311090765411E-263,1.1377176542422E-261,2.11275437254966E-260,3.8891508739597E-259,7.09662549104884E-258,1.28363142232467E-256,2.30154883377474E-255,4.09064220204129E-254,7.20699608473339E-253,1.25866053246326E-251,2.17898642733486E-250,3.73931511233738E-249,6.36093972133308E-248,1.07261093049367E-246,1.79289529412761E-245,2.97070450717936E-244,4.87928122966043E-243,7.9440901241208E-242,1.28210750027486E-240,2.05114676075606E-239,3.25282798181098E-238,5.11349195645254E-237,7.96831009631858E-236,1.23085557902705E-234,1.88469138253562E-233,2.86065654617939E-232,4.30411210943053E-231,6.41939155779687E-230,9.49066511989435E-229,1.39088741818603E-227,2.02059795906074E-226,2.90978231753178E-225,4.15368737946381E-224,5.87759811456185E-223,8.24439517560952E-222,1.14633249868025E-220,1.57999371864224E-219,2.15870415430957E-218,2.92364048114799E-217,3.92507482051674E-216,5.22354221862718E-215,6.89089349844723E-214,9.01113070565203E-213,1.16809032721234E-211,1.50095274089361E-210,1.91183816403757E-209,2.41395305282527E-208,3.02134392063936E-207,3.74856657095168E-206,4.61024579149739E-205,5.62052378421719E-204,6.79240272944722E-203,8.1369952929132E-202,9.66270615266211E-201,1.13743771428874E-199,1.32724376195127E-198,1.53521092760941E-197,1.76027199653617E-196,2.00071832453399E-195,2.25416986472696E-194,2.51757215763064E-193,2.78722411564927E-192,3.05883894658309E-191,3.32763871482049E-190,3.58848094230027E-189,3.83601344815717E-188,4.06485148528055E-187,4.26976933358801E-186,4.44589702724598E-185,4.58891197621194E-184,4.69521500093815E-183,4.76208078900544E-182,4.78777399809105E-181,4.77162410117319E-180,4.71405446765164E-179,4.61656391969309E-178,4.48166188538636E-177,4.31276106514849E-176,4.11403401943114E-175,3.89024208698113E-174,3.64654641224492E-173,3.38831151437109E-172,3.12091174873639E-171,2.84955023797298E-170,2.57909848185594E-169,2.3139630363124E-168,2.05798355098381E-167,1.81436425195147E-166,1.58563882406278E-165,1.37366673628575E-164,1.17965748074925E-163,1.00421803822554E-162,8.47418173780762E-162,7.08867899636641E-161,5.8780157675713E-160,4.83163594757403E-159,3.93691287294463E-158,3.17991616254469E-157,2.54609104156465E-156,2.02083431144533E-155,1.58995976354081E-154,1.240053265188E-153,9.58723689340079E-153,7.34760199763759E-152,5.58209176324444E-151,4.20385415723267E-150,3.13832395395287E-149,2.32245606200353E-148,1.70371516590022E-147,1.23892885203306E-146,8.93091153352558E-146,6.38183250482099E-145,4.52059252402307E-144,3.1742843277846E-143,2.20951495945469E-142,1.52457532439347E-141,1.04280188391803E-140,7.07059355480371E-140,4.75238100193125E-139,3.16641701589543E-138,2.09134953402173E-137,1.36926329163255E-136,8.88687"}}},"buckets"]
[null,null,null,null,null,"Human utility",null,null,null,null,"pos exp mean/variance",{"$f":"STupidExcelMean(L6)","v":7.0620256985400632E+50},{"$f":"STupidExcelVariance(L6,L7)","v":5.959747492242024E+109},"Warning: takes a long time to evaluate (30 seconds on my machine)"]
[null,null,null,null,null,"humans per star",{"$f":"VLOOKUP($F8,Globals!$N$36:$P$42,2,FALSE)","v":100000000000},{"$f":"VLOOKUP($F8,Globals!$N$36:$P$42,3,FALSE)","v":0.78030414607237897}]
["Hedonium utility",null,null,null,null,"utility per wealthy human",{"$f":"VLOOKUP(F9,Globals!$A$21:$L$30,11,FALSE)","v":1},{"$f":"VLOOKUP(F9,Globals!$A$21:$L$30,12,FALSE)","v":0},"assumes there will be no poverty in the far future",null,"factory farming weighted utility",{"$f":"G16*O9","v":5.4644157967709579E+33},{"$f":"H16","v":2.7310645112533267},"P(factory farming exists)",{"$f":"p_biological*p_not_care_about_animals*p_factory_farming","v":9.6000000000000016E-2}]
["utility per hedonium",{"$f":"VLOOKUP(A10,Globals!$A$21:$L$30,11,FALSE)","v":1000},{"$f":"VLOOKUP(A10,Globals!$A$21:$L$30,12,FALSE)","v":0},null,null,"utility estimate",{"$f":"PRODUCT(G$3:G$4)*PRODUCT(G8:G9)","v":3.1622776601683788E+34},{"$f":"SUM(H$3:H$4)+SUM(H8:H9)","v":2.7310645112533267},null,null,"wild vertebrate weighted utility",{"$f":"G22*O10","v":5.1200000000000003E+36},{"$f":"H22","v":3.1212165842895159},"P(wild vertebrates exist)",{"$f":"p_biological*p_not_care_about_animals*p_spread_was","v":0.12800000000000003}]
{"$rows_left_out":26}
{"sheet":"GiveDirectly","index":3,"n_rows":31,"n_cols":13,"rows_kept":31,"cut":false,"hidden":false,"merged":[]}
["Inputs (80% CI)",null,null,null,null,"Direct effect"]
[null,"Low CI","High CI","Notes",null,null,"Mu","Sigma^2 (orders of magnitude)","Sigma"]
["cost per year to end poverty ($)",50000000000,2000000000000,"from looking at random articles I found on Google, combined with Fermi estimate (1.2B people, $1/day ~= $500B/yr)",null,"utility estimate",1,{"$f":"I3^2","v":4.0000000000000008E-2},0.2]
["P(extinction)",0.1,0.5,"implicitly correlated with P(AI-related extinction) on the AI Safety sheet",null,"Pareto posterior",{"$f":"ParetoPosterior(median,alpha,G3:H3)","v":0.85832741114212496}]
["proportion of extinction scenarios averted by ending poverty",5.0000000000000001E-3,0.2,null,null,"Log-normal posterior",{"$f":"LognormPosterior(mu_global_poverty,sigma_global_poverty,G3:H3)","v":"disabled"}]
["proportion of extinction scenarios caused by ending poverty",{"$f":"B5*1.01","v":5.0499999999999998E-3},{"$f":"C5*1.01","v":0.20200000000000001}]
["poverty ended per $1000",{"$f":"1000/C3*interest_rate","v":2.5000000000000004E-11},{"$f":"1000/B3*interest_rate","v":1.0000000000000001E-9}]
["days factory-farm suffering caused per $1000",1.21,192,"http://effective-altruism.com/ea/rl/quantifying_the_impact_of_economic_growth_on_meat/",null,"Extinction risk reduction",null,null,null,null,"Extinction risk increase"]
["years factory-farm suffering per $1000",{"$f":"B8/365","v":3.3150684931506848E-3},{"$f":"C8/365","v":0.52602739726027392},null,null,null,"Mu","Sigma^2",null,null,null,"Mu","Sigma^2"]
[null,null,null,null,null,"P(extinction)",{"$f":"GEOMEAN($B$4,$C$4)","v":0.22360679774997896},{"$f":"LogVariance($B$4,$C$4)","v":0.27270459618181209},null,null,"P(extinction)",{"$f":"GEOMEAN($B$4,$C$4)","v":0.22360679774997896},{"$f":"LogVariance($B$4,$C$4)","v":0.27270459618181209}]
{"$rows_left_out":22}
{"sheet":"THL","index":4,"n_rows":35,"n_cols":15,"rows_kept":35,"cut":false,"hidden":false,"merged":[]}
["Inputs (80% CI)",null,null,null,null,null,null,"Direct effect",null,null,null,null,"Far-future effect on suffering simulations"]
[null,"Low CI","High CI","Mu","Sigma^2","Notes",null,null,"Mu","Sigma^2 (orders of magnitude)",null,null,null,"Mu","Sigma^2"]
["years factory farming prevented per $1",0.7,13,null,null,"Estimated by doubling the 80% CI given by http://www.animalcharityevaluators.org/research/interventions/impact-calculator/. Excludes shellfish.",null,"years factory farming prevented per $1000",{"$f":"D4","v":3016.620625799671},{"$f":"E4","v":0.49504262895320128},null,null,"suffering simulations prevented",{"$f":"VLOOKUP(M3,$A$18:$E$21,4,FALSE)","v":4.4721359549995794E-2},{"$f":"VLOOKUP(M3,$A$18:$E$21,5,FALSE)","v":0.50759954989056688}]
["years factory farming prevented per $1000",{"$f":"B3*1000","v":700},{"$f":"C3*1000","v":13000},{"$f":"GEOMEAN(B4,C4)","v":3016.620625799671},{"$f":"LogVariance(B4,C4)","v":0.49504262895320128},null,null,"utility per factory farmed animal",{"$f":"VLOOKUP($H4,Globals!$A$22:$L$30,11,FALSE)","v":1.7999999999999998},{"$f":"VLOOKUP($H4,Globals!$A$22:$L$30,12,FALSE)","v":0},null,null,"simulation weighted utility",{"$f":"VLOOKUP($M4,'EV of Far Future'!$K$3:$N$14,2,FALSE)","v":3.8399999999999992E+38},{"$f":"VLOOKUP($M4,'EV of Far Future'!$K$3:$N$14,3,FALSE)","v":4.6818248764342734}]
[null,null,null,null,null,null,null,"utility estimate",{"$f":"PRODUCT(I3:I4)","v":5429.9171264394072},{"$f":"SUM(J3:J4)","v":0.49504262895320128},null,null,"1/memetically relevant humans",{"$f":"$D$7","v":7.0700000000000004E-10},{"$f":"$E$7","v":0.11744747699999999}]
["memetically relevant humans",1000000000,2000000000,null,null,null,null,"Pareto posterior",{"$f":"ParetoPosterior(median,alpha,I5:J5)","v":396.49368154968971},null,null,null,"veg-years permanently created per $1000",{"$f":"$D$16","v":39.692256431966342},{"$f":"$E$16","v":0.54824135785953976}]
["1/memetically relevant humans",5.0000000000000003E-10,1.0000000000000001E-9,7.0700000000000004E-10,0.11744747699999999,null,null,"log-normal posterior",{"$f":"LognormPosterior(mu_factory_farming,sigma_factory_farming,I5:J5)","v":194.83133807235006},null,null,null,"utility estimate",{"$f":"PRODUCT(N3:N6)","v":4.8191608764285387E+29},{"$f":"SUM(O3:O6)","v":5.8551132611843801}]
["vegetarians per $1000",22,323,{"$f":"GEOMEAN(B8,C8)","v":84.297093662830392},{"$f":"LogVariance(B8,C8)","v":0.45522157394153262},"Estimated by doubling the 80% CI for online ads from https://docs.google.com/spreadsheets/d/1YSkZDTWacpkmnZMdRsIMLuCOdIILNVmGTIQAomZDxD4"]
["years spent being vegetarian",5,8,{"$f":"GEOMEAN(B9,C9)","v":6.324555320336759},{"$f":"LogVariance(B9,C9)","v":7.9637834381320105E-2},"https://docs.google.com/spreadsheets/d/1YSkZDTWacpkmnZMdRsIMLuCOdIILNVmGTIQAomZDxD4"]
["vegetarian-years per $1000",null,null,{"$f":"D8*D9","v":533.14163221418005},{"$f":"E8+E9","v":0.53485940832285273},null,null,"Far-future effect on factory farming",null,null,null,null,"Far-future effect on hedonium"]
{"$rows_left_out":26}
{"sheet":"Cage-Free","index":5,"n_rows":38,"n_cols":15,"rows_kept":38,"cut":false,"hidden":false,"merged":[]}
["Inputs (80% CI)",null,null,null,null,null,null,"Direct effect",null,null,null,null,"Far-future effect on suffering simulations"]
[null,"Low CI","High CI","Mu","Sigma^2","Notes",null,null,"Mu","Sigma^2",null,null,null,"Mu","Sigma^2"]
["total expenditures ($M)",2,3,null,null,"includes all money spent on cage-free campaigns",null,"cage-free years per $1000",{"$f":"D10","v":295803.98915498087},{"$f":"E10","v":0.31528753718843733},null,null,"suffering simulations prevented",{"$f":"VLOOKUP(M3,THL!$A$18:$E$21,4,FALSE)","v":4.4721359549995794E-2},{"$f":"VLOOKUP(M3,THL!$A$18:$E$21,5,FALSE)","v":0.50759954989056688}]
["1/expenditures",{"$f":"1/C3","v":0.33333333333333331},{"$f":"1/B3","v":0.5},{"$f":"GEOMEAN(B4,C4)","v":0.40824829046386302},{"$f":"LogVariance(B4,C4)","v":6.8702369764126706E-2},null,null,"utility per cage removed",{"$f":"Globals!K24","v":0.3},{"$f":"Globals!L24","v":0},null,null,"simulation weighted utility",{"$f":"VLOOKUP($M4,'EV of Far Future'!$K$3:$N$14,2,FALSE)","v":3.8399999999999992E+38},{"$f":"VLOOKUP($M4,'EV of Far Future'!$K$3:$N$14,3,FALSE)","v":4.6818248764342734}]
["years until cage-free would have happened anyway",5,10,{"$f":"GEOMEAN(B5,C5)","v":7.0710678118654755},{"$f":"LogVariance(B5,C5)","v":0.11744747685437738},"http://www.openphilanthropy.org/blog/initial-grants-support-corporate-cage-free-reforms#Corporate_cage-free_campaigns_are_extremely_cost-effective",null,"utility estimate",{"$f":"I3*I4","v":88741.196746494257},{"$f":"J3+J4","v":0.31528753718843733},null,null,"1/memetically relevant humans",{"$f":"THL!$D$7","v":7.0700000000000004E-10},{"$f":"THL!$E$7","v":0.11744747699999999}]
["millions of cages prevented",100,150,122.47448713915891,6.8702369764126706E-2,null,null,"Pareto posterior",{"$f":"ParetoPosterior(median,alpha,I5:J5)","v":16679.269175199799},null,null,null,"veg-years per cage-free year",{"$f":"$D$11","v":1.7320508075688773E-2},{"$f":"$E$11","v":0.59415429945387477}]
["proportion of change attributable to campaigns",0.7,1,{"$f":"GEOMEAN(B7,C7)","v":0.83666002653407556},{"$f":"LogVariance(B7,C7)","v":6.0435320805806568E-2},null,null,"Log-normal posterior",{"$f":"LognormPosterior(mu_factory_farming,sigma_factory_farming,I5:J5)","v":2531.88913733256},null,null,null,"veg-years permanently created per $1000",{"$f":"THL!$D$16","v":39.692256431966342},{"$f":"THL!$E$16","v":0.54824135785953976}]
["cage-free years per cage prevented",1,1,1,0,"http://www.unitedegg.org/GeneralStats/default.cfm",null,null,null,null,null,null,"utility estimate",{"$f":"PRODUCT(N3:N7)","v":8.3470314878223899E+27},{"$f":"SUM(O3:O7)","v":6.4492675606382548}]
["cage-free years per $1",null,null,{"$f":"PRODUCT(D4:D8)","v":295.80398915498085},{"$f":"SUM(E4:E8)","v":0.31528753718843733}]
["cage-free years per $1000",null,null,{"$f":"D9*1000","v":295803.98915498087},{"$f":"E9","v":0.31528753718843733},null,null,"Far-future effect on factory farming"]
{"$rows_left_out":29}
{"sheet":"AI Safety","index":6,"n_rows":34,"n_cols":14,"rows_kept":34,"cut":false,"hidden":false,"merged":[]}
["General","(80% CI)",null,null,null,null,"Model 1 (GPP)","(80% CI)","http://globalprioritiesproject.org/2015/08/quantifyingaisafety/"]
[null,"Low CI","High CI","Mu","Sigma^2",null,null,"Low CI","High CI","Mu","Sigma^2"]
["cost per AI researcher",70000,150000,null,null,"some uncertainty here about how to account for counterfactuals; presumably AI safety researchers would do something high value otherwise","P(AI-related extinction)",0.03,0.3,{"$f":"GEOMEAN(H3,I3)","v":9.4868329805051374E-2},{"$f":"LogVariance(H3,I3)","v":0.39015207303618948},"Estimated from FHI x-risk survey. CI for probability represents uncertainty about estimate."]
["1/cost per AI researcher",{"$f":"1/C3","v":6.6666666666666666E-6},{"$f":"1/B3","v":1.4285714285714285E-5},{"$f":"GEOMEAN(B4,C4)","v":9.7590007294853309E-6},{"$f":"LogVariance(B4,C4)","v":0.12913769056993327},null,"size of FAI community when AGI created",200,10000,null,null,"See https://intelligence.org/2014/01/28/how-big-is-ai/"]
[null,null,null,null,null,null,"1/size of FAI community when AGI created",{"$f":"1/I4","v":1E-4},{"$f":"1/H4","v":5.0000000000000001E-3},{"$f":"GEOMEAN(H5,I5)","v":7.0710678118654762E-4},{"$f":"LogVariance(H5,I5)","v":0.66285666921800146}]
[null,null,null,null,null,null,"AI researcher multiplicative effect",1,3,{"$f":"GEOMEAN(H6,I6)","v":1.7320508075688774},{"$f":"LogVariance(H6,I6)","v":0.18614984661850412},"If we add 1 new researcher now, there will be this many new researchers by the time AGI is developed."]
[null,null,null,null,null,null,"proportion of bad scenarios averted by doubling total research",0.1,0.7,{"$f":"GEOMEAN(H7,I7)","v":0.26457513110645903},{"$f":"LogVariance(H7,I7)","v":0.32971675223038288}]
[null,null,null,null,null,null,"x-risk averted per $1000",null,null,{"$f":"J3*J5*J6*J7*D4*1000","v":2.9999999999999999E-7},{"$f":"K3+K5+K6+K7+E4","v":1.6980130316730113}]
["Results",null,null,null,null,null,null,null,null,null,null,null,null," "]
["Unified model"]
{"$rows_left_out":25}
{"sheet":"AI Targeted Values Spreading","index":7,"n_rows":24,"n_cols":10,"rows_kept":24,"cut":false,"hidden":false,"merged":[]}
["Inputs (80% CI)",null,null,null,null,null,null,"Model"]
[null,"Low CI","High CI","Mu","Sigma^2","Notes",null,null,"Mu","Sigma^2"]
["P(friendly AI gets built)",0.1,0.5,{"$f":"GEOMEAN(B3,C3)","v":0.22360679774997896},{"$f":"LogVariance(B3,C3)","v":0.27270459618181209},null,null,"hedonium weighted utility",{"$f":"VLOOKUP(H3,'EV of Far Future'!$K$3:$M$14,2,FALSE)","v":6.3245553203367595E+46},{"$f":"VLOOKUP(H3,'EV of Far Future'!$K$3:$M$14,3,FALSE)","v":3.5113686573257055}]
["P(FAI is bad for animals by default)",0.2,0.8,{"$f":"GEOMEAN(B4,C4)","v":0.4},{"$f":"LogVariance(B4,C4)","v":0.23489495370875477},null,null,"dolorium weighted utility",{"$f":"VLOOKUP(H4,'EV of Far Future'!$K$3:$M$14,2,FALSE)","v":1.2649110640673518E+46},{"$f":"VLOOKUP(H4,'EV of Far Future'!$K$3:$M$14,3,FALSE)","v":3.5113686573257055}]
["P(AI researchers' values matter)",0.1,0.6,{"$f":"GEOMEAN(B5,C5)","v":0.2449489742783178},{"$f":"LogVariance(B5,C5)","v":0.30359732347288149},null,null,"factory farming weighted utility",{"$f":"VLOOKUP(H5,'EV of Far Future'!$K$3:$M$14,2,FALSE)","v":5.4644157967709579E+33},{"$f":"VLOOKUP(H5,'EV of Far Future'!$K$3:$M$14,3,FALSE)","v":2.7310645112533267}]
["number of AI researchers when AGI created",5000,100000,null,null,"Different from size of AI safety community; presumably all AI researchers could matter. See https://intelligence.org/2014/01/28/how-big-is-ai/",null,"wild vertebrate weighted utility",{"$f":"VLOOKUP(H6,'EV of Far Future'!$K$3:$M$14,2,FALSE)","v":5.1200000000000003E+36},{"$f":"VLOOKUP(H6,'EV of Far Future'!$K$3:$M$14,3,FALSE)","v":3.1212165842895159}]
["1/number of AI researchers",{"$f":"1/C6","v":1.0000000000000001E-5},{"$f":"1/B6","v":2.0000000000000001E-4},{"$f":"GEOMEAN(B7,C7)","v":4.4721359549995795E-5},{"$f":"LogVariance(B7,C7)","v":0.50759954989056688},null,null,"insect weighted utility",{"$f":"VLOOKUP(H7,'EV of Far Future'!$K$3:$M$14,2,FALSE)","v":1.6190861620062103E+40},{"$f":"VLOOKUP(H7,'EV of Far Future'!$K$3:$M$14,3,FALSE)","v":3.5113686573257055}]
["values propagation multiplier",0.5,5,{"$f":"GEOMEAN(B8,C8)","v":1.5811388300841898},{"$f":"LogVariance(B8,C8)","v":0.39015207303618948},"If we change one researcher's values today, this many researchers' values will change by the time AGI is developed.",null,"simulation weighted utility",{"$f":"VLOOKUP(H8,'EV of Far Future'!$K$3:$M$14,2,FALSE)","v":3.8399999999999992E+38},{"$f":"VLOOKUP(H8,'EV of Far Future'!$K$3:$M$14,3,FALSE)","v":4.6818248764342734}]
["cost to convince one AI researcher to care about animals",1000,100000]
["$1000/cost",{"$f":"1000/C9","v":0.01},{"$f":"1000/B9","v":1},{"$f":"GEOMEAN(B10,C10)","v":0.1},{"$f":"LogVariance(B10,C10)","v":0.78030414607237897},null,null,"hedonium utility estimate",{"$f":"D13*I3","v":1.4142135623730952E+45},{"$f":"E13+J3","v":3.7840732535075174}]
{"$rows_left_out":14}